{"text_format":"1","workbook":"xlsx","n_sheets":6,"sheets":["Faktura s DPH","Faktura bez DPH","Položky","Odběratelé","Seznam faktur","Nastavení"],"not_rendered":{"charts":0,"images":0,"macros":1,"external_links":0,"defined_names":6,"comments":0,"pivot_tables":0},"unopened":[],"bounds":{"document_bytes":16777216,"sheet_cells":100000,"rows_first":2000,"rows_last":500,"rows_between":2000,"halvings":0,"cell_chars":16384,"cell_head_chars":4096},"cells_cut":0,"cells_raw":0,"read":"whole","date_system":"1900"}

{"sheet":"Faktura s DPH","index":0,"n_rows":49,"n_cols":16,"rows_kept":49,"cut":false,"hidden":false,"merged":[[47,7,48,9],[39,0,39,3],[40,0,40,3],[41,0,41,3],[42,0,42,3],[43,8,43,9],[44,0,47,3],[45,8,45,9],[44,8,44,9],[31,0,31,3],[32,0,32,3],[47,4,48,6],[33,0,33,3],[34,0,34,3],[35,0,35,3],[36,0,36,3],[37,0,37,3],[38,0,38,3],[26,0,26,3],[27,0,27,3],[29,0,29,3],[30,0,30,3],[22,0,22,3],[23,0,23,3],[24,0,24,3],[25,0,25,3],[17,0,18,3],[19,0,19,3],[20,0,20,3],[21,0,21,3],[15,0,15,4],[16,0,16,3],[4,0,4,4],[4,5,4,9],[11,0,11,1],[11,2,11,4],[5,0,5,4],[10,5,10,9],[10,0,10,4],[6,0,6,1],[6,2,6,4],[6,6,6,9],[14,0,14,4],[14,5,14,6],[14,7,14,9],[5,5,5,9],[15,7,15,9],[7,6,7,9],[9,5,9,9],[13,0,13,4],[13,5,13,6],[13,7,13,9],[12,0,12,4],[12,5,12,6],[12,7,12,9],[28,10,28,12],[20,10,20,12],[32,10,32,12],[17,10,17,12],[11,5,11,6],[11,7,11,9],[15,5,15,6],[24,10,24,12],[0,0,0,4],[0,7,0,8],[0,10,0,12],[2,5,3,9],[2,10,2,12],[1,0,1,4],[1,5,1,9],[3,0,3,4],[2,0,2,4]]}
["Faktura - Daňový doklad",null,null,null,null,null,"číslo:",{"$f":"N1","v":"01/017"},null,null,"1. Číslo faktury:",null,null,"01/017",{"$f":"IFERROR(IF(N1=VLOOKUP(H1,'Seznam faktur'!A:A,1,FALSE),\"Shoda!!!\"),\"OK\")","v":"OK"},"Pokud Shoda!!!, je číslo faktury v Seznamu faktur."]
["Dodavatel:",null,null,null,null,"Odběratel:"]
[{"$f":"Nastavení!A3","v":"Jiří Pavelka"},null,null,null,null,{"$f":"INDEX(Odběratelé!$B2:$B199,MATCH('Faktura s DPH'!$N$3,Odběratelé!$A2:$A199))","v":"První elastická s.r.o."},null,null,null,null,"2. Odběratel:",null,null,1]
[]
[{"$f":"Nastavení!B3","v":"Jabloňovice 215"},null,null,null,null,{"$f":"INDEX(Odběratelé!$C$2:$C$199,MATCH('Faktura s DPH'!$N$3,Odběratelé!$A2:$A199))","v":"Petrákovice 2"}]
[{"$f":"Nastavení!C3","v":"469 22 Jabloňovice"},null,null,null,null,{"$f":"INDEX(Odběratelé!$D$2:$D$199,MATCH('Faktura s DPH'!$N$3,Odběratelé!$A2:$A199))","v":"689 02 Janovo Pole"}]
[{"$f":"\"IČ: \"&Nastavení!D3&\" \"","v":"IČ: 12345678 "},null,{"$f":"\"DIČ: \"&Nastavení!E3&\" \"","v":"DIČ: CZ8004027558 "},null,null,"IČ:",{"$f":"INDEX(Odběratelé!$E$2:$E$199,MATCH('Faktura s DPH'!$N$3,Odběratelé!$A2:$A199))","v":45897652}]
[{"$f":"\"Č.J. \"&Nastavení!F3&\" \"","v":"Č.J. ŽÚ/01608/98/Ha "},null,{"$f":"\"E.Č. \"&Nastavení!G3&\" \"","v":"E.Č. 381403-2097-01 "},null,null,"DIČ:",{"$f":"INDEX(Odběratelé!$F$2:$F$199,MATCH('Faktura s DPH'!$N$3,Odběratelé!$A2:$A199))","v":"CZ45897652"}]
[{"$f":"\"Peněžní ústav: \"&Nastavení!H3&\" \"","v":"Peněžní ústav: Komerční banka Trnov "}]
[{"$f":"\"Číslo účtu: \"&Nastavení!I3&\" \"","v":"Číslo účtu: 519908-581/0100 "}]
[]
["Poznámka:",null,null,null,null,"Datum vystavení",null,{"$f":"TODAY()","v":"2017-01-09"},null,null,"splatné za ",14,"dní"]
[{"$f":"Nastavení!A6","v":"Fakturovaná částka byla stanovena dohodou"},null,null,null,null,"Dat.usk.zd.plnění",null,{"$f":"EOMONTH(TODAY(),-1)","v":"2016-12-31"}]
[null,null,null,null,null,"Datum splatnosti",null,{"$f":"$H$12+$L$12","v":"2017-01-23"},null,null,"DPH",21,"%"]
[null,null,null,null,null,"Forma úhrady",null,"Převodem na účet"]
[null,null,null,null,null,null,null,null,null,null,"Množství",1,"ks"]
["Označení položky",null,null,null,"Cena","Množství","Základ DPH","DPH %","DPH Kč","Celkem"]
[{"$f":"INDEX(Položky!$B2:$B202,MATCH('Faktura s DPH'!N18,Položky!$A2:$A202))","v":"Na základě smlouvy z 1.1.2016 Vám fakturujeme zprostředkování prodeje výrobků a poradenství "},null,null,null,{"$f":"INDEX(Položky!$C2:$C202,MATCH('Faktura s DPH'!N18,Položky!$A2:$A202))","v":10550},{"$f":"IF(L16>0,L16,\"Nelze!!\")","v":1},{"$f":"IF($E18>0,($E18*F18),\"\")","v":10550},{"$f":"IF(H21>0,$L$14,\"\")","v":21},{"$f":"IF($E18>0,$E18*F18*($L$14/100),\"\")","v":2215.5},{"$f":"IF($E18>0,$E18*F18*(($L$14+100)/100),\"\")","v":12765.5},"3. Položky:",null,null,1]
[null,null,null,null,null,null,{"$f":"IF($E19>0,$E19,\"\")","v":""},{"$f":"IF($E19>0,$L$14,\"\")","v":""},{"$f":"IF($E19>0,$E19*($L$14/100),\"\")","v":""},{"$f":"IF($E19>0,$E19*(($L$14+100)/100),\"\")","v":""}]
[null,null,null,null,null,null,"","","",""]
[null,null,null,null,null,null,"","","","","4a. Tisk",null,null,null,null,"Vytiskne fakturu na výchozí tiskárně"]
[null,null,null,null,null,null,"","","",""]
[null,null,null,null,null,null,"","","",""]
[null,null,null,null,null,null,"","","",""]
[null,null,null,null,null,null,"","","","","4b. Uložit do PDF"]
[null,null,null,null,null,null,"","","",""]
[null,null,null,null,null,null,"","","",""]
[null,null,null,null,null,null,"","","",""]
[null,null,null,null,null,null,null,null,null,null,"5. Uložit do listu Seznam"]
[null,null,null,null,null,null,"",{"$f":"IF($E30>0,$L$14,\"\")","v":""},{"$f":"IF($E30>0,$E30*($L$14/100),\"\")","v":""},{"$f":"IF($E30>0,$E30*(($L$14+100)/100),\"\")","v":""}]
[null,null,null,null,null,null,"","","",""]
[null,null,null,null,null,null,"","","",""]
[null,null,null,null,null,null,"","","","","6. Uložit Excel"]
[null,null,null,null,null,null,"","","",""]
[null,null,null,null,null,null,"","","",""]
[null,null,null,null,null,null,"","","",""]
[null,null,null,null,null,null,"","","",""]
[null,null,null,null,null,null,"","","",""]
[null,null,null,null,null,null,"","","",""]
[null,null,null,null,null,null,"","","",""]
[null,null,null,null,null,null,"","","",""]
[null,null,null,null,null,null,"","","",""]
[null,null,null,null,null,null,"","","",""]
[{"$f":"\"Vystavil: \"&A3&\" \"","v":"Vystavil: Jiří Pavelka "},null,null,null,null,"základ DPH","sazba DPH","DPH","Celkem s DPH"]
[null,null,null,null,null,{"$f":"IF($E18>0,SUM($E18:$E43),\"\")","v":10550},{"$f":"L14%","v":0.21},{"$f":"IF($E18>0,$L$14/100*E18,\"\")","v":2215.5},{"$f":"IF($E18>0,$F45*(($L$14+100)/100),\"\")","v":12765.5},{"$f":"IF($E47>0,$E47*(($L$14+100)/100),\"\")","v":""}]
[]
[]
[null,null,null,null,"Celkem k úhradě :",null,null,{"$f":"ROUND(I45,2)","v":12765.5}]
["Razítko a podpis"]

{"sheet":"Faktura bez DPH","index":1,"n_rows":49,"n_cols":16,"rows_kept":49,"cut":false,"hidden":false,"merged":[[2,0,2,4],[2,5,3,9],[2,10,2,12],[3,0,3,4],[0,0,0,4],[0,7,0,8],[0,10,0,12],[1,0,1,4],[1,5,1,9],[4,0,4,4],[4,5,4,9],[5,0,5,4],[5,5,5,9],[6,0,6,1],[6,2,6,4],[6,6,6,9],[7,6,7,9],[9,5,9,9],[10,0,10,4],[10,5,10,9],[11,0,11,1],[11,2,11,4],[11,5,11,6],[11,7,11,9],[12,0,12,4],[12,5,12,6],[12,7,12,9],[13,0,13,4],[13,5,13,6],[13,7,13,9],[14,0,14,4],[14,5,14,6],[14,7,14,9],[15,0,15,4],[15,5,15,6],[15,7,15,9],[17,10,17,12],[19,0,19,3],[20,0,20,3],[20,10,20,12],[16,0,16,6],[17,0,18,6],[17,7,18,7],[17,8,18,8],[17,9,18,9],[28,10,28,12],[29,0,29,3],[30,0,30,3],[31,0,31,3],[21,0,21,3],[22,0,22,3],[23,0,23,3],[24,0,24,3],[24,10,24,12],[25,0,25,3],[26,0,26,3],[27,0,27,3],[32,10,32,12],[33,0,33,3],[34,0,34,3],[35,0,35,3],[36,0,36,3],[32,0,32,3],[44,0,47,3],[47,4,48,6],[47,7,48,9],[37,0,37,3],[38,0,38,3],[39,0,39,3],[40,0,40,3],[41,0,41,3],[42,0,42,3]]}
["Faktura - Daňový doklad",null,null,null,null,null,"číslo:",{"$f":"N1","v":"01/017"},null,null,"1. Číslo faktury:",null,null,"01/017",{"$f":"IFERROR(IF(N1=VLOOKUP(H1,'Seznam faktur'!A:A,1,FALSE),\"Shoda!!!\"),\"OK\")","v":"OK"},"Pokud Shoda!!!, je číslo faktury v Seznamu faktur."]
["Dodavatel:",null,null,null,null,"Odběratel:"]
[{"$f":"Nastavení!A3","v":"Jiří Pavelka"},null,null,null,null,{"$f":"INDEX(Odběratelé!$B2:$B199,MATCH('Faktura bez DPH'!$N$3,Odběratelé!$A2:$A199))","v":"První elastická s.r.o."},null,null,null,null,"2. Odběratel:",null,null,1]
[]
[{"$f":"Nastavení!B3","v":"Jabloňovice 215"},null,null,null,null,{"$f":"INDEX(Odběratelé!$C$2:$C$199,MATCH('Faktura bez DPH'!$N$3,Odběratelé!$A2:$A199))","v":"Petrákovice 2"}]
[{"$f":"Nastavení!C3","v":"469 22 Jabloňovice"},null,null,null,null,{"$f":"INDEX(Odběratelé!$D$2:$D$199,MATCH('Faktura bez DPH'!$N$3,Odběratelé!$A2:$A199))","v":"689 02 Janovo Pole"}]
[{"$f":"\"IČ: \"&Nastavení!D3&\" \"","v":"IČ: 12345678 "},null,{"$f":"\"DIČ: \"&Nastavení!E3&\" \"","v":"DIČ: CZ8004027558 "},null,null,"IČ:",{"$f":"INDEX(Odběratelé!$E$2:$E$199,MATCH('Faktura bez DPH'!$N$3,Odběratelé!$A2:$A199))","v":45897652}]
[{"$f":"\"Č.J. \"&Nastavení!F3&\" \"","v":"Č.J. ŽÚ/01608/98/Ha "},null,{"$f":"\"E.Č. \"&Nastavení!G3&\" \"","v":"E.Č. 381403-2097-01 "},null,null,"DIČ:",{"$f":"INDEX(Odběratelé!$F$2:$F$199,MATCH('Faktura bez DPH'!$N$3,Odběratelé!$A2:$A199))","v":"CZ45897652"}]
[{"$f":"\"Peněžní ústav: \"&Nastavení!H3&\" \"","v":"Peněžní ústav: Komerční banka Trnov "}]
[{"$f":"\"Číslo účtu: \"&Nastavení!I3&\" \"","v":"Číslo účtu: 519908-581/0100 "}]
[]
["Poznámka:",null,null,null,null,"Datum vystavení",null,{"$f":"TODAY()","v":"2017-01-09"}]
[{"$f":"Nastavení!A6","v":"Fakturovaná částka byla stanovena dohodou"},null,null,null,null,"Dat.usk.zd.plnění",null,{"$f":"EOMONTH(TODAY(),-1)","v":"2016-12-31"}]
[null,null,null,null,null,"Datum splatnosti",null,{"$f":"$H$12+$L$14","v":"2017-01-23"},null,null,"splatné za ",14,"dní"]
[null,null,null,null,null,"Forma úhrady",null,"Převodem na účet"]
[null,null,null,null,null,null,null,null,null,null,"Množství",1,"ks"]
["Označení položky",null,null,null,null,null,null,"Cena","Množství","Celkem"]
[{"$f":"INDEX(Položky!$B2:$B202,MATCH('Faktura bez DPH'!N18,Položky!$A2:$A202))","v":"Na základě ústní objednávky z 07/15 Vám fakturujeme poskytování poradenských služeb"},null,null,null,null,null,null,{"$f":"INDEX(Položky!$C2:$C202,MATCH('Faktura bez DPH'!N18,Položky!$A2:$A202))","v":9000},{"$f":"IF(L16>0,L16,\"Nelze!!\")","v":1},{"$f":"IF($H18>0,$H18*I18,\"\")","v":9000},"3. Položky:",null,null,2]
[]
[null,null,null,null,null,null,{"$f":"IF($E20>0,$E20,\"\")","v":""},{"$f":"IF($E20>0,#REF!,\"\")","v":""},{"$f":"IF($E20>0,$E20*(#REF!/100),\"\")","v":""},{"$f":"IF($E20>0,$E20*((#REF!+100)/100),\"\")","v":""}]
[null,null,null,null,null,null,"",{"$f":"IF($E21>0,#REF!,\"\")","v":""},{"$f":"IF($E21>0,$E21*(#REF!/100),\"\")","v":""},{"$f":"IF($E21>0,$E21*((#REF!+100)/100),\"\")","v":""},"4a. Tisk",null,null,null,null,"Vytiskne fakturu na výchozí tiskárně"]
[null,null,null,null,null,null,"",{"$f":"IF($E22>0,#REF!,\"\")","v":""},{"$f":"IF($E22>0,$E22*(#REF!/100),\"\")","v":""},{"$f":"IF($E22>0,$E22*((#REF!+100)/100),\"\")","v":""}]
[null,null,null,null,null,null,"",{"$f":"IF($E23>0,#REF!,\"\")","v":""},{"$f":"IF($E23>0,$E23*(#REF!/100),\"\")","v":""},{"$f":"IF($E23>0,$E23*((#REF!+100)/100),\"\")","v":""}]
[null,null,null,null,null,null,"",{"$f":"IF($E24>0,#REF!,\"\")","v":""},{"$f":"IF($E24>0,$E24*(#REF!/100),\"\")","v":""},{"$f":"IF($E24>0,$E24*((#REF!+100)/100),\"\")","v":""}]
[null,null,null,null,null,null,"",{"$f":"IF($E25>0,#REF!,\"\")","v":""},{"$f":"IF($E25>0,$E25*(#REF!/100),\"\")","v":""},{"$f":"IF($E25>0,$E25*((#REF!+100)/100),\"\")","v":""},"4b. Uložit do PDF"]
[null,null,null,null,null,null,"",{"$f":"IF($E26>0,#REF!,\"\")","v":""},{"$f":"IF($E26>0,$E26*(#REF!/100),\"\")","v":""},{"$f":"IF($E26>0,$E26*((#REF!+100)/100),\"\")","v":""}]
[null,null,null,null,null,null,"",{"$f":"IF($E27>0,#REF!,\"\")","v":""},{"$f":"IF($E27>0,$E27*(#REF!/100),\"\")","v":""},{"$f":"IF($E27>0,$E27*((#REF!+100)/100),\"\")","v":""}]
[null,null,null,null,null,null,"",{"$f":"IF($E28>0,#REF!,\"\")","v":""},{"$f":"IF($E28>0,$E28*(#REF!/100),\"\")","v":""},{"$f":"IF($E28>0,$E28*((#REF!+100)/100),\"\")","v":""}]
[null,null,null,null,null,null,null,null,null,null,"5. Uložit do listu Seznam"]
[null,null,null,null,null,null,"",{"$f":"IF($E30>0,#REF!,\"\")","v":""},{"$f":"IF($E30>0,$E30*(#REF!/100),\"\")","v":""},{"$f":"IF($E30>0,$E30*((#REF!+100)/100),\"\")","v":""}]
[null,null,null,null,null,null,"",{"$f":"IF($E31>0,#REF!,\"\")","v":""},{"$f":"IF($E31>0,$E31*(#REF!/100),\"\")","v":""},{"$f":"IF($E31>0,$E31*((#REF!+100)/100),\"\")","v":""}]
[null,null,null,null,null,null,"",{"$f":"IF($E32>0,#REF!,\"\")","v":""},{"$f":"IF($E32>0,$E32*(#REF!/100),\"\")","v":""},{"$f":"IF($E32>0,$E32*((#REF!+100)/100),\"\")","v":""}]
[null,null,null,null,null,null,"",{"$f":"IF($E33>0,#REF!,\"\")","v":""},{"$f":"IF($E33>0,$E33*(#REF!/100),\"\")","v":""},{"$f":"IF($E33>0,$E33*((#REF!+100)/100),\"\")","v":""},"6. Uložit Excel"]
[null,null,null,null,null,null,"",{"$f":"IF($E34>0,#REF!,\"\")","v":""},{"$f":"IF($E34>0,$E34*(#REF!/100),\"\")","v":""},{"$f":"IF($E34>0,$E34*((#REF!+100)/100),\"\")","v":""}]
[null,null,null,null,null,null,"",{"$f":"IF($E35>0,#REF!,\"\")","v":""},{"$f":"IF($E35>0,$E35*(#REF!/100),\"\")","v":""},{"$f":"IF($E35>0,$E35*((#REF!+100)/100),\"\")","v":""}]
[null,null,null,null,null,null,"",{"$f":"IF($E36>0,#REF!,\"\")","v":""},{"$f":"IF($E36>0,$E36*(#REF!/100),\"\")","v":""},{"$f":"IF($E36>0,$E36*((#REF!+100)/100),\"\")","v":""}]
[null,null,null,null,null,null,"",{"$f":"IF($E37>0,#REF!,\"\")","v":""},{"$f":"IF($E37>0,$E37*(#REF!/100),\"\")","v":""},{"$f":"IF($E37>0,$E37*((#REF!+100)/100),\"\")","v":""}]
[null,null,null,null,null,null,"",{"$f":"IF($E38>0,#REF!,\"\")","v":""},{"$f":"IF($E38>0,$E38*(#REF!/100),\"\")","v":""},{"$f":"IF($E38>0,$E38*((#REF!+100)/100),\"\")","v":""}]
[null,null,null,null,null,null,"",{"$f":"IF($E39>0,#REF!,\"\")","v":""},{"$f":"IF($E39>0,$E39*(#REF!/100),\"\")","v":""},{"$f":"IF($E39>0,$E39*((#REF!+100)/100),\"\")","v":""}]
[null,null,null,null,null,null,"",{"$f":"IF($E40>0,#REF!,\"\")","v":""},{"$f":"IF($E40>0,$E40*(#REF!/100),\"\")","v":""},{"$f":"IF($E40>0,$E40*((#REF!+100)/100),\"\")","v":""}]
[null,null,null,null,null,null,"",{"$f":"IF($E41>0,#REF!,\"\")","v":""},{"$f":"IF($E41>0,$E41*(#REF!/100),\"\")","v":""},{"$f":"IF($E41>0,$E41*((#REF!+100)/100),\"\")","v":""}]
[null,null,null,null,null,null,"",{"$f":"IF($E42>0,#REF!,\"\")","v":""},{"$f":"IF($E42>0,$E42*(#REF!/100),\"\")","v":""},{"$f":"IF($E42>0,$E42*((#REF!+100)/100),\"\")","v":""}]
[null,null,null,null,null,null,"",{"$f":"IF($E43>0,#REF!,\"\")","v":""},{"$f":"IF($E43>0,$E43*(#REF!/100),\"\")","v":""},{"$f":"IF($E43>0,$E43*((#REF!+100)/100),\"\")","v":""}]
[{"$f":"\"Vystavil: \"&A3&\" \"","v":"Vystavil: Jiří Pavelka "}]
[]
[]
[]
[null,null,null,null,"Celkem k úhradě :",null,null,{"$f":"ROUND(J18,2)","v":9000}]
["Razítko a podpis"]

{"sheet":"Položky","index":2,"n_rows":9,"n_cols":3,"rows_kept":9,"cut":false,"hidden":false,"merged":[]}
["Číslo","Položka","Cena"]
[1,"Na základě smlouvy z 1.1.2016 Vám fakturujeme zprostředkování prodeje výrobků a poradenství ",10550]
[2,"Na základě ústní objednávky z 07/15 Vám fakturujeme poskytování poradenských služeb",9000]
[3]
[4]
[5]
[6]
[7]
[8]

{"sheet":"Odběratelé","index":3,"n_rows":201,"n_cols":6,"rows_kept":201,"cut":false,"hidden":false,"merged":[]}
["Číslo","Název firmy","Ulice, č.p.","Město, PSČ","IČ","DIČ"]
[1,"První elastická s.r.o.","Petrákovice 2","689 02 Janovo Pole",45897652,"CZ45897652"]
[2,"Jan Lipták","Halanov","450 01 Halanov",85697452,"Neplátce DPH"]
[3]
[4]
[5]
[6]
[7]
[8]
[9]
[10]
[{"$f":"A11+1","v":11}]
[{"$f":"A12+1","v":12}]
[{"$f":"A13+1","v":13}]
[14]
[15]
[16]
[17]
[18]
[19]
[20]
[21]
[22]
[23]
[24]
[25]
[26]
[27]
[28]
[29]
[30]
[31]
[32]
[33]
[34]
[35]
[36]
[37]
[38]
[39]
[40]
[41]
[42]
[43]
[44]
[45]
[46]
[47]
[48]
[49]
[50]
[51]
[52]
[53]
[54]
[55]
[56]
[57]
[58]
[59]
[60]
[61]
[62]
[63]
[64]
[65]
[66]
[67]
[68]
[69]
[70]
[71]
[72]
[73]
[74]
[75]
[76]
[{"$f":"A77+1","v":77}]
[78]
[79]
[80]
[81]
[82]
[83]
[84]
[85]
[86]
[87]
[88]
[89]
[90]
[91]
[92]
[93]
[94]
[95]
[96]
[97]
[98]
[99]
[100]
[101]
[102]
[103]
[104]
[105]
[106]
[107]
[108]
[109]
[110]
[111]
[112]
[113]
[114]
[115]
[116]
[117]
[118]
[119]
[120]
[121]
[122]
[123]
[124]
[125]
[126]
[127]
[128]
[129]
[130]
[131]
[132]
[133]
[134]
[135]
[136]
[137]
[138]
[139]
[140]
[{"$f":"A141+1","v":141}]
[142]
[143]
[144]
[145]
[146]
[147]
[148]
[149]
[150]
[151]
[152]
[153]
[154]
[155]
[156]
[157]
[158]
[159]
[160]
[161]
[162]
[163]
[164]
[165]
[166]
[167]
[168]
[169]
[170]
[171]
[172]
[173]
[174]
[175]
[176]
[177]
[178]
[179]
[180]
[181]
[182]
[183]
[184]
[185]
[186]
[187]
[188]
[189]
[190]
[191]
[192]
[193]
[194]
[195]
[196]
[197]
[198]
[{"$f":"A199+1","v":199}]
[{"$f":"A200+1","v":200}]

{"sheet":"Seznam faktur","index":4,"n_rows":1,"n_cols":6,"rows_kept":1,"cut":false,"hidden":false,"merged":[]}
["Číslo faktury","Odběratel","Datum","Částka","Splatnost","Datum úhrady"]

{"sheet":"Nastavení","index":5,"n_rows":6,"n_cols":9,"rows_kept":6,"cut":false,"hidden":false,"merged":[[5,0,5,8]]}
["O mně"]
["Jméno","Adresa 1","Adresa 2","IČ","DIČ","Č.J.","J.Č.","Banka","Číslo účtu"]
["Jiří Pavelka","Jabloňovice 215","469 22 Jabloňovice",12345678,"CZ8004027558","ŽÚ/01608/98/Ha","381403-2097-01","Komerční banka Trnov","519908-581/0100"]
[]
["Poznámka do faktury"]
["Fakturovaná částka byla stanovena dohodou"]